{"text_format":"1","workbook":"xlsx","n_sheets":7,"sheets":["Calculator","Kaller","Ford","GM","Unit conv","Fjäderkurva","Tempdatabladet"],"not_rendered":{"charts":2,"images":8,"macros":1,"external_links":3,"defined_names":14,"comments":0,"pivot_tables":0},"unopened":[],"bounds":{"document_bytes":16777216,"sheet_cells":100000,"rows_first":2000,"rows_last":500,"rows_between":2000,"halvings":0,"cell_chars":16384,"cell_head_chars":4096},"cells_cut":0,"cells_raw":0,"read":"whole","date_system":"1900"}

{"sheet":"Calculator","index":0,"n_rows":60,"n_cols":34,"rows_kept":60,"cut":false,"hidden":false,"merged":[]}
[null,"Indexval från listor. Input till kod",null,null,null,"Lbox 6","LBox 7","LBox 8",null,null,"Vald produkt",null,null,"Fi","Fs","Fylltryck"]
[null,"val1","val2","val3",null,"TU",250,10,null,null,"TU",250,10,2650,3500,150]
[null,1,1,1,null,"X",500,12.7,null,null,"Kolumn 7 Ska vara StrCode"]
[null,null,null,null,null,"TX",750,16,null,null,"TU 250-10"]
[null,"Lbox 9 Varumärke",null,null,null,"R19",1500,25,null,null,{"$f":"FIND(\"-\",K4)","v":7}]
[null,"KALLER",1,"Index",null,"M2",3000,38.1,null,null,{"$f":"LEFT(K4,K5-1)","v":"TU 250"}]
[null,"FORD",null,null,null,"MC3",5000,50]
[null,"GM",null,null,null,"CU4",7500,63.5]
[null,"tblKaller",null,null,null,"CX",10000,80,null,null,"Hämtat från temperaturbladet"]
[null,null,null,null,null,"K",null,100,null,null,{"$f":"VLOOKUP($K$6,Tempdatabladet!$A$1:$AD$167,16,0)","v":22.647529921091891},null,null,{"$f":"IF(ISERROR(K10),\"Temperature data not available\",\"\")","v":""}]
[null,null,null,null,null,"LCF",null,125,null,null,{"$f":"IF(ISERROR(K10),\"No data\",K10)","v":22.647529921091891},"om no data",null,"Felmeddelande om tempdata saknas"]
[null,null,null,null,null,"XG"]
[null,null,null,null,null,"R12"]
[null,null,null,null,null,"R15"]
[null,null,null,null,null,"TL",null,null,null,null,{"$f":"VLOOKUP($K$6,Tempdatabladet!$A$1:$AD$167,17,0)","v":32.647529921091888}]
[null,null,null,null,null,"TUS",null,null,null,null,{"$f":"IF(ISERROR(K15),\"No data\",K15)","v":32.647529921091888},"om no data",null,null,null,null,null,null,null,null,"Number of gas Springs",null,null,1,"pcs"]
[null,null,null,null,null,"TUR",null,null,null,null,null,null,null,null,null,null,null,null,null,null,"Filling Pressure",null,null,150,{"$f":"'Unit conv'!B18","v":"bar"},{"$f":"CONCATENATE(\"Maximum filling pressure is \",P2*FLOOR('Unit conv'!B17,0.01),\" \",'Unit conv'!B18)","v":"Maximum filling pressure is 150 bar"},null,null,{"$f":"IF(X17>P2*'Unit conv'!B17,\"Filling Pressure to High!\",\"\")","v":""}]
[null,null,null,null,null,"XF",null,null,null,null,null,null,null,null,null,null,null,null,null,null,"Used Stroke",null,null,10,"mm",{"$f":"Fjäderkurva!D51","v":""}]
[null,null,null,null,null,null,null,null,null,null,null,null,null,null,null,null,null,null,null,null,"Frequency",null,null,20,"spm"]
[null,null,null,null,null,null,null,null,null,null,null,null,null,null,null,null,null,null,null,null,"Surrounding Temperature",null,null,20,"°C"]
{"$rows_left_out":41}
{"sheet":"Kaller","index":1,"n_rows":863,"n_cols":14,"rows_kept":863,"cut":false,"hidden":true,"merged":[]}
["Detta är värden ur katalog/MC",null,null,"Serie","Modell","Slagl","Fi","Fs","Tryck","StrCode"]
[null,null,null,"TU",250,10,2650,3500,150,"TU 250-10"]
[null,null,null,"TU",250,12.7,2650,3500,150,"TU 250-12,7"]
[null,null,null,"TU",250,16,2650,3500,150,"TU 250-16",null,null,"Not:"]
[null,null,null,"TU",250,25,2650,3500,150,"TU 250-25",null,null,"2017-01-11","CU4, CX, K, LCF, XG, R12, R15, TL, TUS, TUR inlagda"]
[null,null,null,"TU",250,38.1,2650,3500,150,"TU 250-38,1"]
[null,null,null,"TU",250,50,2650,3500,150,"TU 250-50"]
[null,null,null,"TU",250,63.5,2650,3500,150,"TU 250-63,5"]
[null,null,null,"TU",250,80,2650,3500,150,"TU 250-80"]
[null,null,null,"TU",250,100,2650,3500,150,"TU 250-100"]
[null,null,null,"TU",250,125,2650,3500,150,"TU 250-125"]
[null,null,null,"TU",500,10,4700,6000,150,"TU 500-10"]
[null,null,null,"TU",500,12.7,4700,6100,150,"TU 500-12,7"]
[null,null,null,"TU",500,25,4700,6400,150,"TU 500-25"]
[null,null,null,"TU",500,38.1,4700,6500,150,"TU 500-38,1"]
[null,null,null,"TU",500,50,4700,6600,150,"TU 500-50"]
[null,null,null,"TU",500,63.5,4700,6600,150,"TU 500-63,5"]
[null,null,null,"TU",500,80,4700,6700,150,"TU 500-80"]
[null,null,null,"TU",500,100,4700,6700,150,"TU 500-100"]
[null,null,null,"TU",500,125,4700,6700,150,"TU 500-125"]
{"$rows_left_out":844}
{"sheet":"Ford","index":2,"n_rows":122,"n_cols":12,"rows_kept":122,"cut":false,"hidden":true,"merged":[]}
["Från W-DX35-62M",null,null,"Serie","Modell","Slagl","Fi","Fs","Tryck","StrCode"]
[null,null,null,"WDX356203",2,16,2650,3500,150,"TU 250-16"]
[null,null,null,"WDX356203",2,25,2650,3500,150,"TU 250-25"]
[null,null,null,"WDX356203",2,38.1,2650,3500,150,"TU 250-38,1"]
[null,null,null,"WDX356203",2,50,2650,3500,150,"TU 250-50"]
[null,null,null,"WDX356203",2,63.5,2650,3500,150,"TU 250-63,5"]
[null,null,null,"WDX356203",2,80,2650,3500,150,"TU 250-80"]
[null,null,null,"WDX356203",2,100,2650,3500,150,"TU 250-100"]
[null,null,null,"WDX356203",2,125,2650,3500,150,"TU 250-125"]
[null,null,null,"WDX356203",7,16,7400,12000,150,"TU 750-16",null,"Finns inte i vår katalog"]
[null,null,null,"WDX356203",7,25,7400,12000,150,"TU 750-25"]
[null,null,null,"WDX356203",7,38.1,7400,12000,150,"TU 750-38,1"]
[null,null,null,"WDX356203",7,50,7400,12000,150,"TU 750-50"]
[null,null,null,"WDX356203",7,63.5,7400,12000,150,"TU 750-63,5"]
[null,null,null,"WDX356203",7,80,7400,12000,150,"TU 750-80"]
[null,null,null,"WDX356203",7,100,7400,12000,150,"TU 750-100"]
[null,null,null,"WDX356203",7,125,7400,12100,150,"TU 750-125"]
[null,null,null,"WDX356203",7,160,7400,12100,150,"TU 750-160"]
[null,null,null,"WDX356203",7,200,7400,12100,150,"TU 750-200"]
[null,null,null,"WDX356203",15,16,15000,23000,150,"TU 1500-16",null,"Finns inte i vår katalog"]
{"$rows_left_out":103}
{"sheet":"GM","index":3,"n_rows":190,"n_cols":10,"rows_kept":190,"cut":false,"hidden":true,"merged":[]}
["GM",null,null,"Serie","Modell","Slagl","Fi","Fs","Tryck","StrCode"]
[null,null,null,"90.25.00",1.5,10,2000,3060,180,"MC3 SP-10"]
[null,null,null,"90.25.00",1.5,16,2000,3070,180,"MC3 SP-16"]
[null,null,null,"90.25.00",1.5,25,2000,3080,180,"MC3 SP-25"]
[null,null,null,"90.25.00",1.5,50,2000,3090,180,"MC3 SP-50"]
[null,null,null,"90.25.00",1.5,80,2000,3040,180,"MC3 SP-80"]
[null,null,null,"90.25.00",1.5,100,2000,3050,180,"MC3 SP-100"]
[null,null,null,"90.25.00",1.5,125,2000,3060,180,"MC3 SP-125"]
[null,null,null,"90.25.00",2.5,10,2650,3500,150,"TU 250-10"]
[null,null,null,"90.25.00",2.5,16,2650,3500,150,"TU 250-16"]
[null,null,null,"90.25.00",2.5,25,2650,3500,150,"TU 250-25"]
[null,null,null,"90.25.00",2.5,50,2650,3500,150,"TU 250-50"]
[null,null,null,"90.25.00",2.5,80,2650,3500,150,"TU 250-80"]
[null,null,null,"90.25.00",2.5,100,2650,3500,150,"TU 250-100"]
[null,null,null,"90.25.00",2.5,125,2650,3500,150,"TU 250-125"]
[null,null,null,"90.25.00",5,25,4700,6400,150,"TU 500-25"]
[null,null,null,"90.25.00",5,50,4700,6600,150,"TU 500-50"]
[null,null,null,"90.25.00",5,80,4700,6700,150,"TU 500-80"]
[null,null,null,"90.25.00",5,100,4700,6700,150,"TU 500-100"]
[null,null,null,"90.25.00",5,125,4700,6700,150,"TU 500-125"]
{"$rows_left_out":171}
{"sheet":"Unit conv","index":4,"n_rows":35,"n_cols":10,"rows_kept":35,"cut":false,"hidden":true,"merged":[]}
[]
[]
[]
[]
[]
[]
[]
[]
[]
[]
[]
["Unit convertion"]
[]
[]
[null,null,"Pressure"]
[null,1,"bar",1]
["Konverteringsfaktor",{"$f":"INDEX(D16:D17,B16)","v":1},"psi",14.503773799999999,null,null,null,150,"bar",{"$f":"H17*B17","v":150}]
[null,{"$f":"INDEX(C16:C17,B16)","v":"bar"}]
[]
[]
{"$rows_left_out":16}
{"sheet":"Fjäderkurva","index":5,"n_rows":56,"n_cols":34,"rows_kept":56,"cut":false,"hidden":true,"merged":[]}
[null,null,"Ändring"]
[null,null,"2016-06-07"]
[]
[]
[]
[]
[null,null,null,null,"Input från annan flik",null,null,null,null,null,null,"Virtuell slagvolym"]
[]
[null,null,"Fi",{"$f":"Calculator!N2","v":2650},"N","Initialkraft vid 20 °C",null,null,null,null,null,"Kurva",null,null,null,null,"Iso t kraft per fj"]
[null,null,"Fs",{"$f":"Calculator!O2","v":3500},"N","Detta är isoterm kraftökning",null,null,null,null,null,null,"Slag (mm)","Virtuell volym","Vi / Vf","(Vi / Vf)^kappa","kN eller lbf","Isothermal force at 20 °C","Isothermal force at estimated running temperature","Polytrop kraft per fjäder","Polytropic force at 20 °C","Polytropic force at estimated running temperature",null,null,null,null,"Driftstemperatur",null,null,null,null,null,{"$f":"OFFSET(R10,0,'Unit conv'!$B$34,1,1)","v":"Isothermal force at 20 °C"},{"$f":"OFFSET(S10,0,'Unit conv'!$B$34,1,1)","v":"Isothermal force at estimated running temperature"}]
[null,null,"slagl",{"$f":"Calculator!M2","v":10},"mm",null,null,null,null,null,null,0,{"$f":"L11*$D$14","v":0},{"$f":"$D$26-M11","v":41.176470588235304},{"$f":"$D$26/N11","v":1},{"$f":"O11^$D$35","v":1},{"$f":"$D$45*O11","v":2.65},{"$f":"Q11*$D$15","v":2.65},{"$f":"R11*$AA$17","v":2.7191670794911036},{"$f":"$D$45*P11","v":2.65},{"$f":"$D$15*T11","v":2.65},{"$f":"U11*$AA$17","v":2.7191670794911036},null,null,null,null,{"$f":"Calculator!K10","v":22.647529921091891},null,null,null,null,null,{"$f":"OFFSET(R11,0,'Unit conv'!$B$34,1,1)","v":2.65},{"$f":"OFFSET(S11,0,'Unit conv'!$B$34,1,1)","v":2.7191670794911036}]
[null,null,"Utnyttjad slagl",{"$f":"Calculator!X18","v":10},"mm",null,null,null,null,null,null,0.1,1,40.176470588235304,1.0248901903367496,1.0350188774795315,2.7159590043923862,2.7159590043923862,2.7868476656570609,2.7428000253207583,2.7428000253207583,{"$f":"U12*$AA$17","v":2.8143892582941783},null,null,null,null,{"$f":"Calculator!K15","v":32.647529921091888},null,null,null,null,null,{"$f":"OFFSET(R12,0,'Unit conv'!$B$34,1,1)","v":2.7159590043923862},{"$f":"OFFSET(S12,0,'Unit conv'!$B$34,1,1)","v":2.7868476656570609}]
[null,null,"Använd slaglängd ev reducerad till max",{"$f":"IF(D12>D11,D11,D12)","v":10},"mm",null,null,null,null,null,null,0.2,2,39.176470588235304,1.0510510510510511,1.0721939076620992,2.7852852852852852,2.7852852852852852,2.8579834168825413,2.8413138553045627,2.8413138553045627,2.9154743765457045,null,null,null,null,"Medel",null,null,null,null,null,{"$f":"OFFSET(R13,0,'Unit conv'!$B$34,1,1)","v":2.7852852852852852},{"$f":"OFFSET(S13,0,'Unit conv'!$B$34,1,1)","v":2.8579834168825413}]
[null,null,"utnyttjad slagl mm",{"$f":"D13","v":10},"mm",null,null,null,null,null,null,0.3,3,38.176470588235304,1.078582434514638,1.1117181102047662,2.8582434514637907,2.8582434514637907,2.9328458484495727,2.9460529920426302,2.9460529920426302,3.0229472869428631,null,null,null,null,{"$f":"IFERROR((AA11+AA12)*0.5,20)","v":27.647529921091888},null,null,null,null,null,{"$f":"OFFSET(R14,0,'Unit conv'!$B$34,1,1)","v":2.8582434514637907},{"$f":"OFFSET(S14,0,'Unit conv'!$B$34,1,1)","v":2.9328458484495727}]
[null,null,"Antal fjädrar",{"$f":"Calculator!X16","v":1},"st",null,null,null,null,null,null,0.4,4,37.176470588235304,1.1075949367088607,1.1538074702036489,2.9351265822784809,2.9351265822784809,3.0117356893097669,3.0575897960396694,3.0575897960396694,3.1373952890486745,null,null,null,null,null,null,null,null,null,null,{"$f":"OFFSET(R15,0,'Unit conv'!$B$34,1,1)","v":2.9351265822784809},{"$f":"OFFSET(S15,0,'Unit conv'!$B$34,1,1)","v":3.0117356893097669}]
[null,null,"Status tryckenhet",{"$f":"'Unit conv'!B17","v":1},{"$f":"'Unit conv'!B18","v":"bar"},null,null,null,null,null,null,0.5,5,36.176470588235304,1.1382113821138211,1.1987043847336178,3.0162601626016259,3.0162601626016259,3.0949869197459718,3.1765666195440874,3.1765666195440874,3.2594775010092922,null,null,null,null,"ktemp (273+T)/(237+20)",null,null,null,null,null,{"$f":"OFFSET(R16,0,'Unit conv'!$B$34,1,1)","v":3.0162601626016259},{"$f":"OFFSET(S16,0,'Unit conv'!$B$34,1,1)","v":3.0949869197459718}]
[null,null,"Status kraftenhet",{"$f":"'Unit conv'!B23","v":1},{"$f":"'Unit conv'!B24","v":"kN"},null,null,null,null,null,null,0.6,6,35.176470588235304,1.1705685618729096,1.246681739919657,3.1020066889632103,3.1020066889632103,3.1829714977320611,3.3037066107870912,3.3037066107870912,3.3899359457922218,null,null,null,null,{"$f":"(273+AA14)/(273+20)","v":1.0261007847136241},null,null,null,null,null,{"$f":"OFFSET(R17,0,'Unit conv'!$B$34,1,1)","v":3.1020066889632103},{"$f":"OFFSET(S17,0,'Unit conv'!$B$34,1,1)","v":3.1829714977320611}]
[null,null,"tryck från control",{"$f":"Calculator!X17","v":150},null,null,null,null,null,null,null,0.7,7,34.176470588235304,1.2048192771084336,1.2980477558381693,3.1927710843373491,3.1927710843373491,3.2761049150495225,3.4398265529711485,3.4398265529711485,3.5296087252824559,null,null,null,null,null,null,null,null,null,null,{"$f":"OFFSET(R18,0,'Unit conv'!$B$34,1,1)","v":3.1927710843373491},{"$f":"OFFSET(S18,0,'Unit conv'!$B$34,1,1)","v":3.2761049150495225}]
[null,null,"ger i bar",{"$f":"D18/D16","v":150},"bar",null,null,null,null,null,null,0.8,8,33.176470588235304,1.2411347517730495,1.3531517715111263,3.289007092198581,3.289007092198581,3.3748527582336392,3.5858521945044846,3.5858521945044846,3.6794457506481226,null,null,null,null,null,null,null,null,null,null,{"$f":"OFFSET(R19,0,'Unit conv'!$B$34,1,1)","v":3.289007092198581},{"$f":"OFFSET(S19,0,'Unit conv'!$B$34,1,1)","v":3.3748527582336392}]
[null,null,"Fjädertryck ur tabell",{"$f":"Calculator!P2","v":150},"bar",null,null,null,null,null,null,0.9,9,32.176470588235304,1.2797074954296159,1.412391187495964,3.3912248628884822,3.3912248628884822,3.479738492950224,3.7428366468643044,3.7428366468643044,3.8405276204023724,null,null,null,null,null,null,null,null,null,null,{"$f":"OFFSET(R20,0,'Unit conv'!$B$34,1,1)","v":3.3912248628884822},{"$f":"OFFSET(S20,0,'Unit conv'!$B$34,1,1)","v":3.479738492950224}]
{"$rows_left_out":37}
{"sheet":"Tempdatabladet","index":6,"n_rows":167,"n_cols":41,"rows_kept":167,"cut":false,"hidden":true,"merged":[]}
["Nya kolumner",null,"Gröna kolumner visas i databladet"]
[]
[null,null,null,null,null,"Kolumn F"]
[null,null,null,null,null,"Tagit bort listboxarna/MC"]
[]
[null,null,null,null,null,null,null,null,null,null,null,null,null,null,null,null,null,null,null,null,null,null,null,null,null,null,null,null,null,null,null,null,"Införs i steg"]
[null,null,"T4SC-","CU4",null,"Strokelength","Utilized","Fill pressure","Frequency","Env./Tool","Env./Tool","Env./Tool",null,null,null,"Estimated running",null,{"$f":"P7","v":"Estimated running"},null,null,null,"F° env./tool",null,null,null,null,null,{"$f":"P7","v":"Estimated running"},null,null,null,null,1]
[null,null,null,null,null,null,"strokelength",null,null,"temperature","temperature","temperature","Rörlängd","Röryta","Fjäderfaktor","temperature between:",null,"temperature between:",null,null,null,"temp.",null,null,null,null,null,{"$f":"P8","v":"temperature between:"},null,null,null,null,1]
[null,null,"Spring Size","Spring Size",null,null,"[mm]","[Bar]","[spm]","[°C]","[°F]","[°C]","L (approx)","A","Kf","[°C]","[°C]","[°C]","[°C]","P som [°F]","Q som [°F]","to C°","N + T","U + 10°C","U to F°","V to F°","[°F]","[°F]","[°C]","[°C]",null,null,1]
[{"$f":"CONCATENATE(\"CU4\",\" \",D10)","v":"CU4 420"},null,420,420,null,{"$f":"Calculator!$M$2","v":10},{"$f":"Fjäderkurva!$D$14","v":10},{"$f":"Fjäderkurva!$D$19","v":150},{"$f":"Calculator!$X$19","v":20},{"$f":"Calculator!$X$20","v":20},77,{"$f":"5/9*(K10-32)","v":25},{"$f":"39.1+2.146*F10","v":60.56},{"$f":"24.9*PI()*M10*0.01","v":47.373457924248072},{"$f":"0.49+0.017*F10-0.00037*F10^2","v":0.623},{"$f":"G10*H10*I10*(G10/F10)^1.1/(150*N10*O10)+J10","v":26.776522157887584},{"$f":"P10+10","v":36.776522157887584},26.776522157887584,36.776522157887584,{"$f":"9/5*R10+32","v":80.197739884197659},{"$f":"9/5*S10+32","v":98.197739884197659},{"$f":"5/9*(K10-32)","v":25},{"$f":"P10+V10","v":51.776522157887584},{"$f":"W10+10","v":61.776522157887584},{"$f":"9/5*W10+32","v":125.19773988419766},{"$f":"9/5*X10+32","v":143.19773988419766},{"$f":"Y10","v":125.19773988419766},143.19773988419766,{"$f":"5/9*(AA10-32)","v":51.776522157887591},{"$f":"5/9*(AB10-32)","v":61.776522157887591},{"$f":"IF(Q10>80,\"High temp. Please contact your distributor for advice\",IF(H10>150,\"Too high charging pressure!\",\"\"))","v":""},{"$f":"AE10","v":""},1,"Samma som CU",null,null,null,null,null,33,43]
[{"$f":"CONCATENATE(\"CU4\",\" \",D11)","v":"CU4 740"},null,740,740,null,{"$f":"Calculator!$M$2","v":10},{"$f":"Fjäderkurva!$D$14","v":10},{"$f":"Fjäderkurva!$D$19","v":150},{"$f":"Calculator!$X$19","v":20},{"$f":"Calculator!$X$20","v":20},77,{"$f":"5/9*(K11-32)","v":25},{"$f":"45+2*F11","v":65},{"$f":"32*PI()*M11*0.01","v":65.345127194667697},{"$f":"2.5-0.039*F11","v":2.11},{"$f":"G11*H11*I11*(G11/F11)^1.1/(150*N11*O11)+J11","v":21.450555441960404},31.450555441960404,21.450555441960404,31.450555441960404,{"$f":"9/5*R11+32","v":70.610999795528727},88.610999795528727,{"$f":"5/9*(K11-32)","v":25},{"$f":"P11+V11","v":46.450555441960404},{"$f":"W11+10","v":56.450555441960404},{"$f":"9/5*W11+32","v":115.61099979552873},133.61099979552873,115.61099979552873,133.61099979552873,{"$f":"5/9*(AA11-32)","v":46.450555441960404},56.450555441960404,"",{"$f":"AE11","v":""},1,"Samma som CU",null,null,null,null,null,30,40]
["CU4 1000",null,1000,1000,null,{"$f":"Calculator!$M$2","v":10},{"$f":"Fjäderkurva!$D$14","v":10},{"$f":"Fjäderkurva!$D$19","v":150},{"$f":"Calculator!$X$19","v":20},{"$f":"Calculator!$X$20","v":20},77,25,{"$f":"38.9+2.88*F12","v":67.699999999999989},{"$f":"37.9*PI()*M12*0.01","v":80.607926783602977},{"$f":"0.8248-0.002*F12","v":0.80479999999999996},23.082934349486564,33.082934349486564,23.082934349486564,33.082934349486564,73.549281829075824,91.549281829075824,25,48.082934349486564,58.082934349486564,118.54928182907582,136.54928182907582,118.54928182907582,136.54928182907582,48.082934349486571,58.082934349486571,"","",1,"Samma som CU",null,null,null,null,null,28,38]
["CU4 1800",null,1800,1800,null,{"$f":"Calculator!$M$2","v":10},{"$f":"Fjäderkurva!$D$14","v":10},{"$f":"Fjäderkurva!$D$19","v":150},{"$f":"Calculator!$X$19","v":20},{"$f":"Calculator!$X$20","v":20},77,25,{"$f":"46.6+2.535*F13","v":71.95},{"$f":"50.2*PI()*M13*0.01","v":113.4708708957444},{"$f":"0.8713-0.0118*F13","v":0.75329999999999997},22.339794092421435,32.339794092421435,22.339794092421435,32.339794092421435,72.211629366358579,90.211629366358579,25,47.339794092421435,57.339794092421435,117.21162936635858,135.21162936635858,117.21162936635858,135.21162936635858,47.339794092421435,57.339794092421435,"","",1,"Samma som CU + slagl. 65",null,null,null,null,null,30,40]
["CU4 2900",null,2900,2900,null,{"$f":"Calculator!$M$2","v":10},{"$f":"Fjäderkurva!$D$14","v":10},{"$f":"Fjäderkurva!$D$19","v":150},{"$f":"Calculator!$X$19","v":20},{"$f":"Calculator!$X$20","v":20},77,25,{"$f":"55+2*F14","v":75},{"$f":"63.2*PI()*M14*0.01","v":148.91149178015621},{"$f":"1.2-0.0181*F14","v":1.0189999999999999},21.318036985808835,31.318036985808835,21.318036985808835,31.318036985808835,70.372466574455899,88.372466574455899,25,46.318036985808831,56.318036985808831,115.3724665744559,133.3724665744559,115.3724665744559,133.3724665744559,46.318036985808838,56.318036985808838,"","",1,"Samma som CU + slagl. 65",null,null,null,null,null,29,39]
["CU4 4700",null,4700,4700,null,{"$f":"Calculator!$M$2","v":10},{"$f":"Fjäderkurva!$D$14","v":10},{"$f":"Fjäderkurva!$D$19","v":150},{"$f":"Calculator!$X$19","v":20},{"$f":"Calculator!$X$20","v":20},77,25,{"$f":"40+3*F15","v":70},{"$f":"75.2*PI()*M15*0.01","v":165.37343728496671},0.43,22.812521083832181,32.812521083832181,22.812521083832181,32.812521083832181,73.062537950897934,91.062537950897934,25,47.812521083832181,57.812521083832181,118.06253795089793,136.06253795089793,118.06253795089793,136.06253795089793,47.812521083832188,57.812521083832188,"","",1,"Samma som CU + slagl. 65",null,null,null,null,null,27,37]
["CU4 7500",null,7500,7500,null,{"$f":"Calculator!$M$2","v":10},{"$f":"Fjäderkurva!$D$14","v":10},{"$f":"Fjäderkurva!$D$19","v":150},{"$f":"Calculator!$X$19","v":20},{"$f":"Calculator!$X$20","v":20},77,25,{"$f":"50+3*F16","v":80},{"$f":"95.2*PI()*M16*0.01","v":239.26369649739863},0.3,22.786326034521977,32.786326034521977,22.786326034521977,32.786326034521977,73.015386862139565,91.015386862139565,25,47.786326034521977,57.786326034521977,118.01538686213956,136.01538686213956,118.01538686213956,136.01538686213956,47.786326034521984,57.786326034521984,"","",1,"Samma som CU + slagl. 65",null,null,null,null,null,27,37]
["CU4 11800",null,11800,11800,null,{"$f":"Calculator!$M$2","v":10},{"$f":"Fjäderkurva!$D$14","v":10},{"$f":"Fjäderkurva!$D$19","v":150},{"$f":"Calculator!$X$19","v":20},{"$f":"Calculator!$X$20","v":20},77,25,{"$f":"60+3*F17","v":90},{"$f":"120.2*PI()*M17*0.01","v":339.85749326534381},{"$f":"0.247-0.0023*F17","v":0.224},22.62715155778556,32.62715155778556,22.62715155778556,32.62715155778556,72.728872804014003,90.728872804014003,25,47.62715155778556,57.62715155778556,117.728872804014,135.728872804014,117.728872804014,135.728872804014,47.62715155778556,57.62715155778556,"","",1,"Samma som CU + slagl. 65",null,null,null,null,null,29,39]
["CU4 18300",null,18300,18300,null,{"$f":"Calculator!$M$2","v":10},{"$f":"Fjäderkurva!$D$14","v":10},{"$f":"Fjäderkurva!$D$19","v":150},{"$f":"Calculator!$X$19","v":20},{"$f":"Calculator!$X$20","v":20},77,25,{"$f":"70+3*F18","v":100},{"$f":"150.2*PI()*M18*0.01","v":471.86721656918689},{"$f":"0.25-0.0011*F18","v":0.23899999999999999},21.773422806878365,31.773422806878365,21.773422806878365,31.773422806878365,71.192161052381067,89.192161052381067,25,46.773422806878365,56.773422806878365,116.19216105238105,134.19216105238104,116.19216105238105,134.19216105238104,46.773422806878365,56.773422806878358,"","",1,"Samma som CU + slagl. 65",null,null,null,null,null,27,37]
[]
[]
{"$rows_left_out":147}